BDBM50243039 CHEMBL4089108
SMILES COc1ccc2CN(C[C@]3(NC(=O)NC3=O)c3cc4ccccc4o3)C(=O)c2c1
InChI Key InChIKey=XUKDLTMDNYKLGY-NRFANRHFSA-N
Data  1 KI
  Tab Delimited (TSV)   2D SDfile   Computed 3D by Vconf -m prep SDfile
Find this compound or compounds like it in BindingDB:
Activity Spreadsheet -- Enzyme Inhibition Constant Data from BindingDB
Found 1 hit for monomerid = 50243039
LigandPNGBDBM50243039(CHEMBL4089108)
Affinity DataKi:  0.300nM. Assay description: Inhibition of catalytic domain TACE (unknown origin) by FRET assay
In DepthDetails ArticlePubMed