BDBM50243084 CHEMBL4074516
SMILES COc1ccc2CN(C[C@]3(NC(=O)NC3=O)c3cc4cnc(C)cc4o3)C(=O)c2c1F
InChI Key InChIKey=RWWZREVQPBBDHM-NRFANRHFSA-N
Data  1 KI
  Tab Delimited (TSV)   2D SDfile   Computed 3D by Vconf -m prep SDfile
Find this compound or compounds like it in BindingDB:
Activity Spreadsheet -- Enzyme Inhibition Constant Data from BindingDB
Found 1 hit for monomerid = 50243084
LigandPNGBDBM50243084(CHEMBL4074516)
Affinity DataKi:  0.400nM. Assay description: Inhibition of catalytic domain TACE (unknown origin) by FRET assay
In DepthDetails ArticlePubMed