BDBM50243628 1-(4-methoxyphenyl)-6-(4-(1-(morpholinomethyl)cyclopropyl)phenyl)-3-(trifluoromethyl)-5,6-dihydro-1H-pyrazolo[3,4-c]pyridin-7(4H)-one::CHEMBL471565
SMILES COc1ccc(cc1)-n1nc(c2CCN(C(=O)c12)c1ccc(cc1)C1(CN2CCOCC2)CC1)C(F)(F)F
InChI Key InChIKey=FLSCNGWQHIQRMR-UHFFFAOYSA-N
Data  2 KI
  Tab Delimited (TSV)   2D SDfile   Computed 3D by Vconf -m prep SDfile
Find this compound or compounds like it in BindingDB:
Activity Spreadsheet -- Enzyme Inhibition Constant Data from BindingDB
Found 2 hits for monomerid = 50243628
TargetCoagulation factor X(Homo sapiens (Human))
Bristol-Myers Squibb
Curated by ChEMBL
LigandPNGBDBM50243628(1-(4-methoxyphenyl)-6-(4-(1-(morpholinomethyl)cycl...)
Affinity DataKi:  0.0600nM. Assay description: Binding affinity to human coagulation factor 10a
In DepthDetails ArticlePubMed
TargetCoagulation factor X(Homo sapiens (Human))
Bristol-Myers Squibb
Curated by ChEMBL
LigandPNGBDBM50243628(1-(4-methoxyphenyl)-6-(4-(1-(morpholinomethyl)cycl...)
Affinity DataKi:  0.0640nM. Assay description: Inhibition of human factor 10a
In DepthDetails ArticlePubMed