BDBM50243946 CHEMBL453594::N-cycloheptyl-2-(4-(4-fluoropiperidin-1-yl)piperidin-1-yl)-6,7-dimethoxyquinazolin-4-amine
SMILES COc1cc2nc(nc(NC3CCCCCC3)c2cc1OC)N1CCC(CC1)N1CCC(F)CC1
InChI Key InChIKey=BHPCVVBZXHQNET-UHFFFAOYSA-N
Data  1 IC50
  Tab Delimited (TSV)   2D SDfile   Computed 3D by Vconf -m prep SDfile
Find this compound or compounds like it in BindingDB:
Activity Spreadsheet -- Enzyme Inhibition Constant Data from BindingDB
Found 1 hit for monomerid = 50243946
TargetC-C chemokine receptor type 4(Homo sapiens (Human))
Astellas Pharma
Curated by ChEMBL
LigandPNGBDBM50243946(CHEMBL453594 | N-cycloheptyl-2-(4-(4-fluoropiperid...)
Affinity DataIC50:  32nM. Assay description: Antagonist activity at human CCR4 receptor expressed in mouse B300-19 cells by [35S]GTPgammaS binding assay
In DepthDetails ArticlePubMed