BDBM50245968 3,5-bis(4-hydroxyphenyl)-N-phenyl-4,5-dihydro-1H-pyrazole-1-carbothioamide::CHEMBL462550
SMILES Oc1ccc(cc1)C1CC(=NN1C(=S)Nc1ccccc1)c1ccc(O)cc1
InChI Key InChIKey=LGXVPDXUHWGOGM-UHFFFAOYSA-N
Data  2 IC50
  Tab Delimited (TSV)   2D SDfile   Computed 3D by Vconf -m prep SDfile
Find this compound or compounds like it in BindingDB:
Activity Spreadsheet -- Enzyme Inhibition Constant Data from BindingDB
Found 2 hits for monomerid = 50245968
TargetAmine oxidase [flavin-containing] A(Rattus norvegicus (rat))
Institute Of Technology
Curated by ChEMBL
LigandPNGBDBM50245968(3,5-bis(4-hydroxyphenyl)-N-phenyl-4,5-dihydro-1H-p...)
Affinity DataIC50:  3.21E+4nM. Assay description: Inhibition of MAOA in rat liver homogenates preincubated for 60 mins
In DepthDetails ArticlePubMed
TargetAmine oxidase [flavin-containing] B(Rattus norvegicus (rat))
Institute Of Technology
Curated by ChEMBL
LigandPNGBDBM50245968(3,5-bis(4-hydroxyphenyl)-N-phenyl-4,5-dihydro-1H-p...)
Affinity DataIC50:  4.86E+5nM. Assay description: Inhibition of MAOB in rat liver homogenates preincubated for 60 mins
In DepthDetails ArticlePubMed