BDBM50247741 CHEMBL503101::[(1R,2R,6R,10S,11R,15S,17R)-13-benzyl-6-hydroxy-4,17-dimethyl-5-oxo-15-(prop-1-en-2-yl)-12,14,18-trioxapentacyclo[11.4.1.0^{1,10}.0^{2,6}.0^{11,15}]octadeca-3,8-dien-8-yl]methyl 2-(4-methanesulfonamido-3-methoxyphenyl)acetate
SMILES COc1cc(CC(=O)OCC2=C[C@H]3[C@H]4OC5(Cc6ccccc6)O[C@@]4(C[C@@H](C)[C@]3(O5)[C@@H]3C=C(C)C(=O)[C@@]3(O)C2)C(C)=C)ccc1NS(C)(=O)=O
InChI Key InChIKey=QLCHTHMQAIFKIQ-GARMOQFJSA-N
Data  1 KI  1 EC50
  Tab Delimited (TSV)   2D SDfile   Computed 3D by Vconf -m prep SDfile
Find this compound or compounds like it in BindingDB:
Activity Spreadsheet -- Enzyme Inhibition Constant Data from BindingDB
Found 2 hits for monomerid = 50247741
TargetTransient receptor potential cation channel subfamily V member 1(Rattus norvegicus (rat))
Seoul National University
Curated by ChEMBL
LigandPNGBDBM50247741(CHEMBL503101 | [(1R,2R,6R,10S,11R,15S,17R)-13-benz...)
Affinity DataKi:  0.228nM. Assay description: Displacement of [3H]RTX form rat TRPV1 receptor expressed in CHO/VR1 cell system
In DepthDetails ArticlePubMed
TargetTransient receptor potential cation channel subfamily V member 1(Rattus norvegicus (rat))
Seoul National University
Curated by ChEMBL
LigandPNGBDBM50247741(CHEMBL503101 | [(1R,2R,6R,10S,11R,15S,17R)-13-benz...)
Affinity DataEC50:  0.106nM. Assay description: Agonist activity at rat TRPV1 receptor expressed in CHO cells assessed as calcium uptake
In DepthDetails ArticlePubMed