BDBM50250136 CHEMBL4095596
SMILES CC(CCCCCC(=O)NO)n1cc(cn1)-c1ncnc2[nH]ccc12
InChI Key InChIKey=RTLKDFQWSQARBW-UHFFFAOYSA-N
Data  12 IC50
  Tab Delimited (TSV)   2D SDfile   Computed 3D by Vconf -m prep SDfile
Find this compound or compounds like it in BindingDB:
Activity Spreadsheet -- Enzyme Inhibition Constant Data from BindingDB
Found 12 hits for monomerid = 50250136
TargetHistone deacetylase 9(Homo sapiens (Human))
National University Of Singapore
Curated by ChEMBL
LigandPNGBDBM50250136(CHEMBL4095596)
Affinity DataIC50:  8.50E+3nM. Assay description: Inhibition of HDAC9 (unknown origin) in presence of ATP
Ligand InfoPC cidPC sid
In DepthDetails ArticlePubMed
TargetHistone deacetylase 2(Homo sapiens (Human))
National University Of Singapore
Curated by ChEMBL
LigandPNGBDBM50250136(CHEMBL4095596)
Affinity DataIC50:  47nM. Assay description: Inhibition of C-terminal GST tagged human recombinant HDAC2 (1 to 488 residues) expressed in Baculovirus infected insect cells in presence of ATP
Ligand InfoPC cidPC sid
In DepthDetails ArticlePubMed
TargetHistone deacetylase 1(Homo sapiens (Human))
National University Of Singapore
Curated by ChEMBL
LigandPNGBDBM50250136(CHEMBL4095596)
Affinity DataIC50:  6nM. Assay description: Inhibition of C-terminal FLAG His tagged full length human recombinant HDAC1 (1 to 482 residues) expressed in baculovirus infected sf21 cells using R...
Ligand InfoPC cidPC sid
In DepthDetails ArticlePubMed
TargetNon-receptor tyrosine-protein kinase TYK2(Homo sapiens (Human))
National University Of Singapore
Curated by ChEMBL
LigandPNGBDBM50250136(CHEMBL4095596)
Affinity DataIC50:  144nM. Assay description: Inhibition of human TYK2 using KKSRGDYMTMQIG as substrate in presence of [gamma-33P]-ATP
Ligand InfoPC cidPC sid
In DepthDetails ArticlePubMed
TargetTyrosine-protein kinase JAK3(Homo sapiens (Human))
National University Of Singapore
Curated by ChEMBL
LigandPNGBDBM50250136(CHEMBL4095596)
Affinity DataIC50:  436nM. Assay description: Inhibition of human JAK3 using GEEEEYFELVKKKK as substrate in presence of [gamma-33P]-ATP
Ligand InfoPC cidPC sid
In DepthDetails ArticlePubMed
TargetHistone deacetylase 3/Nuclear receptor corepressor 2 (HDAC3/NCoR2)(Homo sapiens (Human))
National University Of Singapore
Curated by ChEMBL
LigandPNGBDBM50250136(CHEMBL4095596)
Affinity DataIC50:  24nM. Assay description: Inhibition of human JAK2 using poly[Glu:Tyr] as substrate in presence of [gamma-33P]-ATP
Ligand InfoPC cidPC sid
In DepthDetails ArticlePubMed
TargetTyrosine-protein kinase JAK2(Homo sapiens (Human))
National University Of Singapore
Curated by ChEMBL
LigandPNGBDBM50250136(CHEMBL4095596)
Affinity DataIC50:  65nM. Assay description: Inhibition of human JAK2 using poly[Glu:Tyr] as substrate in presence of [gamma-33P]-ATP
Ligand InfoPC cidPC sid
In DepthDetails ArticlePubMed
TargetHistone deacetylase 8(Homo sapiens (Human))
National University Of Singapore
Curated by ChEMBL
LigandPNGBDBM50250136(CHEMBL4095596)
Affinity DataIC50:  310nM. Assay description: Inhibition of C-terminal His tagged human recombinant HDAC8 (1 to 377 residues) expressed in Baculovirus infected insect cells in presence of ATP
Ligand InfoPC cidPC sid
In DepthDetails ArticlePubMed
TargetHistone deacetylase 5(Homo sapiens (Human))
National University Of Singapore
Curated by ChEMBL
LigandPNGBDBM50250136(CHEMBL4095596)
Affinity DataIC50:  7.40E+3nM. Assay description: Inhibition of C-terminal His tagged human recombinant HDAC5 (657 to 1123 residues) expressed in Baculovirus infected insect cells in presence of ATP
Ligand InfoPC cidPC sid
In DepthDetails ArticlePubMed
TargetHistone deacetylase 6(Homo sapiens (Human))
National University Of Singapore
Curated by ChEMBL
LigandPNGBDBM50250136(CHEMBL4095596)
Affinity DataIC50:  1nM. Assay description: Inhibition of N-terminal GST tagged human HDAC6 (1 to 1215 residues) expressed in baculovirus infected insect cells using RHKKAc as substrate in pres...
Ligand InfoPC cidPC sid
In DepthDetails ArticlePubMed
TargetPolyamine deacetylase HDAC10(Homo sapiens (Human))
National University Of Singapore
Curated by ChEMBL
LigandPNGBDBM50250136(CHEMBL4095596)
Affinity DataIC50:  31nM. Assay description: Inhibition of human HDAC10 using fluorogenic peptide from p53 residues 379 to 382 as substrate in presence of ATP
Ligand InfoPC cidPC sid
In DepthDetails ArticlePubMed
TargetTyrosine-protein kinase JAK1(Homo sapiens (Human))
National University Of Singapore
Curated by ChEMBL
LigandPNGBDBM50250136(CHEMBL4095596)
Affinity DataIC50:  11nM. Assay description: Inhibition of human JAK1 using poly[Glu:Tyr] as substrate in presence of [gamma-33P]-ATP
Ligand InfoPC cidPC sid
In DepthDetails ArticlePubMed