BDBM50250468 CHEMBL504279::saponarin
SMILES OC[C@H]1O[C@@H](Oc2c(O)c(O[C@@H]3O[C@H](CO)[C@@H](O)[C@H](O)[C@H]3O)c3oc(-c4ccc(O)cc4)c(O)c(=O)c3c2O)[C@H](O)[C@@H](O)[C@@H]1O
InChI Key InChIKey=NMNPSVZZFDIDBI-SRAYOCCYSA-N
Data  1 IC50
  Tab Delimited (TSV)   2D SDfile   Computed 3D by Vconf -m prep SDfile
Find this compound or compounds like it in BindingDB:
Activity Spreadsheet -- Enzyme Inhibition Constant Data from BindingDB
Found 1 hit for monomerid = 50250468
TargetXanthine dehydrogenase/oxidase(Homo sapiens (Human))
University Of Antwerp
Curated by ChEMBL
LigandPNGBDBM50250468(CHEMBL504279 | saponarin)
Affinity DataIC50: >1.00E+5nM. Assay description: Inhibition of xanthine oxidase assessed as decrease in uric acid production by spectrophotometry
In DepthDetails ArticlePubMed