BDBM50251136 3-(3,5-diiodo-4-methoxybenzoyl)-2-propyl-4H-chromen-4-one::CHEMBL457087
SMILES CCCc1oc2ccccc2c(=O)c1C(=O)c1cc(I)c(OC)c(I)c1
InChI Key InChIKey=YKEFZPVBNQHTIE-UHFFFAOYSA-N
Data  1 KI
  Tab Delimited (TSV)   2D SDfile   Computed 3D by Vconf -m prep SDfile
Find this compound or compounds like it in BindingDB:
Activity Spreadsheet -- Enzyme Inhibition Constant Data from BindingDB
Found 1 hit for monomerid = 50251136
TargetCytochrome P450 2C9(Homo sapiens (Human))
Washington State University
Curated by ChEMBL
LigandPNGBDBM50251136(3-(3,5-diiodo-4-methoxybenzoyl)-2-propyl-4H-chrome...)
Affinity DataKi:  44.3nM. Assay description: Binding affinity to CYP2C9 (unknown origin)
In DepthDetails ArticlePubMed