BDBM50251429 4'-Piperazin-1-yl-biphenyl-4-carboxylic acid [(S)-1-(cyanomethyl-carbamoyl)-3-methyl-butyl]-amide::CHEMBL480317
SMILES CC(C)C[C@H](NC(=O)c1ccc(cc1)-c1ccc(cc1)N1CCNCC1)C(=O)NCC#N
InChI Key InChIKey=BMZLFTIZKLRANQ-QHCPKHFHSA-N
Data  1 IC50
  Tab Delimited (TSV)   2D SDfile   Computed 3D by Vconf -m prep SDfile
Find this compound or compounds like it in BindingDB:
Activity Spreadsheet -- Enzyme Inhibition Constant Data from BindingDB
Found 1 hit for monomerid = 50251429
TargetCathepsin K(Homo sapiens (Human))
Merck Research Laboratories
Curated by ChEMBL
LigandPNGBDBM50251429(4'-Piperazin-1-yl-biphenyl-4-carboxylic acid [(S)-...)
Affinity DataIC50:  0.0150nM. Assay description: Inhibition of cathepsin K (unknown origin)
In DepthDetails ArticlePubMed