BDBM50251611 5-methyl-N-(6-(2-methylpyridin-3-yloxy)pyridin-3-yl)-1H-indole-3-carboxamide::CHEMBL480127
SMILES Cc1ccc2[nH]cc(C(=O)Nc3ccc(Oc4cccnc4C)nc3)c2c1
InChI Key InChIKey=ICOOFOPJNLACRM-UHFFFAOYSA-N
Data  8 IC50
  Tab Delimited (TSV)   2D SDfile   Computed 3D by Vconf -m prep SDfile
Find this compound or compounds like it in BindingDB:
Activity Spreadsheet -- Enzyme Inhibition Constant Data from BindingDB
Found 8 hits for monomerid = 50251611
Target5-hydroxytryptamine receptor 2C(Homo sapiens (Human))
Korea Research Institute Of Chemical Technology
Curated by ChEMBL
LigandPNGBDBM50251611(5-methyl-N-(6-(2-methylpyridin-3-yloxy)pyridin-3-y...)
Affinity DataIC50:  4.5nM. Assay description: Displacement of [3H]mesulergine at human cloned 5HT2C receptor expressed in CHOK1 cell
In DepthDetails ArticlePubMed
TargetD(4) dopamine receptor(Homo sapiens (Human))
Korea Research Institute Of Chemical Technology
Curated by ChEMBL
LigandPNGBDBM50251611(5-methyl-N-(6-(2-methylpyridin-3-yloxy)pyridin-3-y...)
Affinity DataIC50: >1.00E+4nM. Assay description: Displacement of [3H]spiperone from human cloned dopamine D4 receptor
In DepthDetails ArticlePubMed
TargetD(3) dopamine receptor(Homo sapiens (Human))
Korea Research Institute Of Chemical Technology
Curated by ChEMBL
LigandPNGBDBM50251611(5-methyl-N-(6-(2-methylpyridin-3-yloxy)pyridin-3-y...)
Affinity DataIC50: >1.00E+4nM. Assay description: Displacement of [3H]spiperone from human cloned dopamine D3 receptor
In DepthDetails ArticlePubMed
Target5-hydroxytryptamine receptor 1A(Homo sapiens (Human))
Korea Research Institute Of Chemical Technology
Curated by ChEMBL
LigandPNGBDBM50251611(5-methyl-N-(6-(2-methylpyridin-3-yloxy)pyridin-3-y...)
Affinity DataIC50: >1.00E+4nM. Assay description: Displacement of [3H]8-OH-DPAT from human cloned 5HT1A receptor
In DepthDetails ArticlePubMed
Target5-hydroxytryptamine receptor 7(Homo sapiens (Human))
Korea Research Institute Of Chemical Technology
Curated by ChEMBL
LigandPNGBDBM50251611(5-methyl-N-(6-(2-methylpyridin-3-yloxy)pyridin-3-y...)
Affinity DataIC50: >1.00E+4nM. Assay description: Displacement of [3H]LSD from human cloned 5HT7 receptor
In DepthDetails ArticlePubMed
Target5-hydroxytryptamine receptor 6(Homo sapiens (Human))
Korea Research Institute Of Chemical Technology
Curated by ChEMBL
LigandPNGBDBM50251611(5-methyl-N-(6-(2-methylpyridin-3-yloxy)pyridin-3-y...)
Affinity DataIC50: >1.00E+4nM. Assay description: Displacement of [3H]LSD from human cloned 5HT6 receptor
In DepthDetails ArticlePubMed
Target5-hydroxytryptamine receptor 2A(Homo sapiens (Human))
Korea Research Institute Of Chemical Technology
Curated by ChEMBL
LigandPNGBDBM50251611(5-methyl-N-(6-(2-methylpyridin-3-yloxy)pyridin-3-y...)
Affinity DataIC50: >1.00E+3nM. Assay description: Displacement of [3H]ketanserin from human cloned 5HT2A receptor
In DepthDetails ArticlePubMed
TargetD(2) dopamine receptor(Homo sapiens (Human))
Korea Research Institute Of Chemical Technology
Curated by ChEMBL
LigandPNGBDBM50251611(5-methyl-N-(6-(2-methylpyridin-3-yloxy)pyridin-3-y...)
Affinity DataIC50: >1.00E+4nM. Assay description: Displacement of [3H]spiperone from human cloned dopamine D2 receptor
In DepthDetails ArticlePubMed