BDBM50252010 2-Furan-2-yl-7-[2-(4'-methoxy-biphenyl-4-yl)-ethyl]-7H-pyrazolo[4,3-e][1,2,4]triazolo[1,5-c]pyrimidin-5-ylamine::CHEMBL521438
SMILES COc1ccc(cc1)-c1ccc(CCn2ncc3c2nc(N)n2nc(nc32)-c2ccco2)cc1
InChI Key InChIKey=RDDAZCQWEKJYCD-UHFFFAOYSA-N
Data  1 KI
  Tab Delimited (TSV)   2D SDfile   Computed 3D by Vconf -m prep SDfile
Find this compound or compounds like it in BindingDB:
Activity Spreadsheet -- Enzyme Inhibition Constant Data from BindingDB
Found 1 hit for monomerid = 50252010
TargetAdenosine receptor A2a(Homo sapiens (Human))
Schering-Plough Research Institute
Curated by ChEMBL
LigandPNGBDBM50252010(2-Furan-2-yl-7-[2-(4'-methoxy-biphenyl-4-yl)-ethyl...)
Affinity DataKi:  0.5nM. Assay description: Antagonist activity at human adenosine A2A receptor
In DepthDetails ArticlePubMed