BDBM50252065 4-[(4-Vinylbenzyl)thio]-7-(beta-D-ribofuranosyl)-7H-pyrrolo[2,3-d]pyrimidine::CHEMBL519463
SMILES OC[C@H]1O[C@H]([C@H](O)[C@@H]1O)n1ccc2c(SCc3ccc(C=C)cc3)ncnc12
InChI Key InChIKey=KSMISLBIBCQUNI-WOCWXWTJSA-N
Data  1 KI
  Tab Delimited (TSV)   2D SDfile   Computed 3D by Vconf -m prep SDfile
Find this compound or compounds like it in BindingDB:
Activity Spreadsheet -- Enzyme Inhibition Constant Data from BindingDB
Found 1 hit for monomerid = 50252065
TargetAdenosine kinase(Toxoplasma gondii)
University Of Georgia
Curated by ChEMBL
LigandPNGBDBM50252065(4-[(4-Vinylbenzyl)thio]-7-(beta-D-ribofuranosyl)-7...)
Affinity DataKi:  1.80E+5nM. Assay description: Binding affinity to purified Toxoplasma gondii adenosine kinase
In DepthDetails ArticlePubMed