BDBM50252158 2-[4-(Chloro-phenyl)carbamoyl-phenyl]-2-oxo-ethyl ethyl trithiocarbonate::CHEMBL480005
SMILES CCSC(=S)SCC(=O)c1ccc(cc1)C(=O)Nc1ccc(Cl)cc1
InChI Key InChIKey=RHEOWXVRBWQOPC-UHFFFAOYSA-N
Data  1 IC50
  Tab Delimited (TSV)   2D SDfile   Computed 3D by Vconf -m prep SDfile
Find this compound or compounds like it in BindingDB:
Activity Spreadsheet -- Enzyme Inhibition Constant Data from BindingDB
Found 1 hit for monomerid = 50252158
TargetHistone deacetylase 6(Homo sapiens (Human))
Nycomed
Curated by ChEMBL
LigandPNGBDBM50252158(2-[4-(Chloro-phenyl)carbamoyl-phenyl]-2-oxo-ethyl ...)
Affinity DataIC50:  1.45E+3nM. Assay description: Inhibition of recombinant HDAC6 (unknown origin) expressed in HEK293 cells
In DepthDetails ArticlePubMed