BDBM50252181 3-[(1,4-trans)-4-(4-Quinolin-5-yl-piperazin-1-yl)-cyclohexyl]-1H-indole-5-carbonitrile::CHEMBL520753
SMILES N#Cc1ccc2[nH]cc([C@H]3CC[C@@H](CC3)N3CCN(CC3)c3cccc4ncccc34)c2c1
InChI Key InChIKey=XSYQLENYJXPDQA-HZCBDIJESA-N
Data  2 KI
  Tab Delimited (TSV)   2D SDfile   Computed 3D by Vconf -m prep SDfile
Find this compound or compounds like it in BindingDB:
Activity Spreadsheet -- Enzyme Inhibition Constant Data from BindingDB
Found 2 hits for monomerid = 50252181
TargetSodium-dependent serotonin transporter(Rattus norvegicus (rat))
Wyeth Research
Curated by ChEMBL
LigandPNGBDBM50252181(3-[(1,4-trans)-4-(4-Quinolin-5-yl-piperazin-1-yl)-...)
Affinity DataKi:  4.90nM. Assay description: Displacement of [3H]paroxetine from rat cortical 5HTT reuptake site
In DepthDetails ArticlePubMed
Target5-hydroxytryptamine receptor 1A(Homo sapiens (Human))
Wyeth Research
Curated by ChEMBL
LigandPNGBDBM50252181(3-[(1,4-trans)-4-(4-Quinolin-5-yl-piperazin-1-yl)-...)
Affinity DataKi:  6.20nM. Assay description: Displacement of [3H]8-OH-DPAT from human 5HT1A receptor expressed in CHO cells
In DepthDetails ArticlePubMed