BDBM50252445 CHEMBL4070855
SMILES C[C@H]1[C@H](COc2ccc(F)cn2)CCCN1C(=O)c1cc(C)ccc1-n1nccn1
InChI Key InChIKey=ZBVUQBPPFVOIKU-IRXDYDNUSA-N
Data  1 KI
  Tab Delimited (TSV)   2D SDfile   Computed 3D by Vconf -m prep SDfile
Find this compound or compounds like it in BindingDB:
Activity Spreadsheet -- Enzyme Inhibition Constant Data from BindingDB
Found 1 hit for monomerid = 50252445
TargetOrexin receptor type 2(Homo sapiens (Human))
Allergan
Curated by ChEMBL
LigandPNGBDBM50252445(CHEMBL4070855)
Affinity DataKi:  0.200nM. Assay description: Displacement of (2S)-N-(2-pyrrol-1-ylphenyl)-1-[2-[1-(tritritiomethyl)benzimidazol-2-yl]sulfanylacetyl]pyrrolidine-2-carboxamide from recombinant hum...
In DepthDetails ArticlePubMed