BDBM50252562 2-[4-(2-Acetylamino-ethyl)-phenyl]-2-oxoethyl ethyl trithiocarbonate::CHEMBL490067
SMILES CCSC(=S)SCC(=O)c1ccc(CCNC(C)=O)cc1
InChI Key InChIKey=HKKFHCWTCWJBML-UHFFFAOYSA-N
Data  2 IC50
  Tab Delimited (TSV)   2D SDfile   Computed 3D by Vconf -m prep SDfile
Find this compound or compounds like it in BindingDB:
Activity Spreadsheet -- Enzyme Inhibition Constant Data from BindingDB
Found 2 hits for monomerid = 50252562
TargetHistone deacetylase 1(Homo sapiens (Human))
Nycomed
Curated by ChEMBL
LigandPNGBDBM50252562(2-[4-(2-Acetylamino-ethyl)-phenyl]-2-oxoethyl ethy...)
Affinity DataIC50:  607nM. Assay description: Inhibition of recombinant HDAC1 (unknown origin) expressed in HEK293 cells
In DepthDetails ArticlePubMed
TargetHistone deacetylase 6(Homo sapiens (Human))
Nycomed
Curated by ChEMBL
LigandPNGBDBM50252562(2-[4-(2-Acetylamino-ethyl)-phenyl]-2-oxoethyl ethy...)
Affinity DataIC50:  102nM. Assay description: Inhibition of recombinant HDAC6 (unknown origin) expressed in HEK293 cells
In DepthDetails ArticlePubMed