BDBM50252591 3-{4-[(1,4-cis)-4-(1H-Indol-4-yl)-pipera-zinyl-1-yl]-cyclohexyl}-1H-indole-5-carbonitrile::CHEMBL494276
SMILES N#Cc1ccc2[nH]cc([C@@H]3CC[C@@H](CC3)N3CCN(CC3)c3cccc4[nH]ccc34)c2c1
InChI Key InChIKey=UKWSMBRBDLPKHS-OYRHEFFESA-N
Data  2 KI
  Tab Delimited (TSV)   2D SDfile   Computed 3D by Vconf -m prep SDfile
Find this compound or compounds like it in BindingDB:
Activity Spreadsheet -- Enzyme Inhibition Constant Data from BindingDB
Found 2 hits for monomerid = 50252591
TargetSodium-dependent serotonin transporter(Rattus norvegicus (rat))
Wyeth Research
Curated by ChEMBL
LigandPNGBDBM50252591(3-{4-[(1,4-cis)-4-(1H-Indol-4-yl)-pipera-zinyl-1-y...)
Affinity DataKi:  1.60nM. Assay description: Displacement of [3H]paroxetine from rat cortical 5HTT reuptake site
In DepthDetails ArticlePubMed
Target5-hydroxytryptamine receptor 1A(Homo sapiens (Human))
Wyeth Research
Curated by ChEMBL
LigandPNGBDBM50252591(3-{4-[(1,4-cis)-4-(1H-Indol-4-yl)-pipera-zinyl-1-y...)
Affinity DataKi:  69.6nM. Assay description: Displacement of [3H]8-OH-DPAT from human 5HT1A receptor expressed in CHO cells
In DepthDetails ArticlePubMed