BDBM50253890 (2-amino-4-((4-benzylpiperazin-1-yl)methyl)thiophen-3-yl)(4-chlorophenyl)methanone::CHEMBL517252
SMILES Nc1scc(CN2CCN(Cc3ccccc3)CC2)c1C(=O)c1ccc(Cl)cc1
InChI Key InChIKey=VLUIIUMESZDQJJ-UHFFFAOYSA-N
Data  2 Kd
  Tab Delimited (TSV)   2D SDfile   Computed 3D by Vconf -m prep SDfile
Find this compound or compounds like it in BindingDB:
Activity Spreadsheet -- Enzyme Inhibition Constant Data from BindingDB
Found 2 hits for monomerid = 50253890
TargetAdenosine receptor A1(Homo sapiens (Human))
Dipartimento Di Scienze Farmaceutiche
Curated by ChEMBL
LigandPNGBDBM50253890((2-amino-4-((4-benzylpiperazin-1-yl)methyl)thiophe...)
Affinity DataKd:  1.10nM. Assay description: Displacement of [3H]CCPA from human adenosine A1 receptor expressed in CHO cells
In DepthDetails ArticlePubMed
TargetAdenosine receptor A1(Homo sapiens (Human))
Dipartimento Di Scienze Farmaceutiche
Curated by ChEMBL
LigandPNGBDBM50253890((2-amino-4-((4-benzylpiperazin-1-yl)methyl)thiophe...)
Affinity DataKd:  1.70nM. Assay description: Displacement of [3H]DPCPX from human adenosine A1 receptor expressed in CHO cells
In DepthDetails ArticlePubMed