BDBM50254896 1-Benzyl-7-methyl-3-(2-hydroxy-ethyl)-1H,8Himidazo[2,1-f]purine-2,4-dione::CHEMBL464076
SMILES Cc1cn2c(nc3n(Cc4ccccc4)c(=O)n(CCO)c(=O)c23)[nH]1
InChI Key InChIKey=QUMHJHHGEFMRTL-UHFFFAOYSA-N
Data  3 KI  1 IC50
  Tab Delimited (TSV)   2D SDfile   Computed 3D by Vconf -m prep SDfile
Find this compound or compounds like it in BindingDB:
Activity Spreadsheet -- Enzyme Inhibition Constant Data from BindingDB
Found 4 hits for monomerid = 50254896
TargetAdenosine receptor A3(Homo sapiens (Human))
Università
Curated by ChEMBL
LigandPNGBDBM50254896(1-Benzyl-7-methyl-3-(2-hydroxy-ethyl)-1H,8Himidazo...)
Affinity DataKi:  38nM. Assay description: Displacement of [3H]MRE3008F20 from human cloned adenosine A3 receptor expressed in CHO cells
In DepthDetails ArticlePubMed
TargetAdenosine receptor A2a(Homo sapiens (Human))
Università
Curated by ChEMBL
LigandPNGBDBM50254896(1-Benzyl-7-methyl-3-(2-hydroxy-ethyl)-1H,8Himidazo...)
Affinity DataKi: >1.00E+3nM. Assay description: Displacement of [3H]ZM241385 from human cloned adenosine A2A receptor expressed in CHO cells
In DepthDetails ArticlePubMed
TargetAdenosine receptor A1(Homo sapiens (Human))
Università
Curated by ChEMBL
LigandPNGBDBM50254896(1-Benzyl-7-methyl-3-(2-hydroxy-ethyl)-1H,8Himidazo...)
Affinity DataKi: >1.00E+3nM. Assay description: Displacement of [3H]DPCPX from human cloned adenosine A1 receptor expressed in CHO cells
In DepthDetails ArticlePubMed
TargetAdenosine receptor A2b(Homo sapiens (Human))
Università
Curated by ChEMBL
LigandPNGBDBM50254896(1-Benzyl-7-methyl-3-(2-hydroxy-ethyl)-1H,8Himidazo...)
Affinity DataIC50: >1.00E+3nM. Assay description: Antagonist activity at human cloned adenosine A2B cells expressed in CHO cells assessed as inhibition of NECA-stimulated cAMP production
In DepthDetails ArticlePubMed