BDBM50254933 (1-Benzyl-7-methyl-2,4-dioxo-1,2,4,8-tetrahydro-imidazo-[2,1-f]purin-3-yl)-acetic acid ethyl ester::CHEMBL465290
SMILES CCOC(=O)Cn1c(=O)n(Cc2ccccc2)c2nc3[nH]c(C)cn3c2c1=O
InChI Key InChIKey=DRLUVSBLMFMBQU-UHFFFAOYSA-N
Data  3 KI  1 IC50
  Tab Delimited (TSV)   2D SDfile   Computed 3D by Vconf -m prep SDfile
Find this compound or compounds like it in BindingDB:
Activity Spreadsheet -- Enzyme Inhibition Constant Data from BindingDB
Found 4 hits for monomerid = 50254933
TargetAdenosine receptor A3(Homo sapiens (Human))
Università
Curated by ChEMBL
LigandPNGBDBM50254933((1-Benzyl-7-methyl-2,4-dioxo-1,2,4,8-tetrahydro-im...)
Affinity DataKi:  20nM. Assay description: Displacement of [3H]MRE3008F20 from human cloned adenosine A3 receptor expressed in CHO cells
In DepthDetails ArticlePubMed
TargetAdenosine receptor A2a(Homo sapiens (Human))
Università
Curated by ChEMBL
LigandPNGBDBM50254933((1-Benzyl-7-methyl-2,4-dioxo-1,2,4,8-tetrahydro-im...)
Affinity DataKi: >1.00E+3nM. Assay description: Displacement of [3H]ZM241385 from human cloned adenosine A2A receptor expressed in CHO cells
In DepthDetails ArticlePubMed
TargetAdenosine receptor A1(Homo sapiens (Human))
Università
Curated by ChEMBL
LigandPNGBDBM50254933((1-Benzyl-7-methyl-2,4-dioxo-1,2,4,8-tetrahydro-im...)
Affinity DataKi: >1.00E+3nM. Assay description: Displacement of [3H]DPCPX from human cloned adenosine A1 receptor expressed in CHO cells
In DepthDetails ArticlePubMed
TargetAdenosine receptor A2b(Homo sapiens (Human))
Università
Curated by ChEMBL
LigandPNGBDBM50254933((1-Benzyl-7-methyl-2,4-dioxo-1,2,4,8-tetrahydro-im...)
Affinity DataIC50: >1.00E+3nM. Assay description: Antagonist activity at human cloned adenosine A2B cells expressed in CHO cells assessed as inhibition of NECA-stimulated cAMP production
In DepthDetails ArticlePubMed