BDBM50255229 CHEMBL482207::N-(4-(5-fluoro-6-methylpyridin-2-yl)-5-(quinoxalin-6-yl)-1H-imidazol-2-yl)isobutyramide
SMILES CC(C)C(=O)Nc1nc(c([nH]1)-c1ccc2nccnc2c1)-c1ccc(F)c(C)n1
InChI Key InChIKey=AKXGHZQCJYYVLK-UHFFFAOYSA-N
Data  1 KI
  Tab Delimited (TSV)   2D SDfile   Computed 3D by Vconf -m prep SDfile
Find this compound or compounds like it in BindingDB:
Activity Spreadsheet -- Enzyme Inhibition Constant Data from BindingDB
Found 1 hit for monomerid = 50255229
TargetTGF-beta receptor type-1(Homo sapiens (Human))
Abbott Laboratories
Curated by ChEMBL
LigandPNGBDBM50255229(CHEMBL482207 | N-(4-(5-fluoro-6-methylpyridin-2-yl...)
Affinity DataKi: >2.80E+4nM. Assay description: Binding affinity to human TGFBR1
In DepthDetails ArticlePubMed