BDBM50256362 CHEMBL470942::N7-(cyclopropylmethyl)-N7-(2-(4-(2,4-difluorophenyl)piperazin-1-yl)ethyl)-2-(furan-2-yl)-[1,2,4]triazolo[1,5-c]pyrimidine-5,7-diamine
SMILES Nc1nc(cc2nc(nn12)-c1ccco1)N(CCN1CCN(CC1)c1ccc(F)cc1F)CC1CC1
InChI Key InChIKey=UUUUCFGJWJWDEN-UHFFFAOYSA-N
Data  1 KI
  Tab Delimited (TSV)   2D SDfile   Computed 3D by Vconf -m prep SDfile
Find this compound or compounds like it in BindingDB:
Activity Spreadsheet -- Enzyme Inhibition Constant Data from BindingDB
Found 1 hit for monomerid = 50256362
TargetAdenosine receptor A2a(Homo sapiens (Human))
Schering-Plough Research Institute
Curated by ChEMBL
LigandPNGBDBM50256362(CHEMBL470942 | N7-(cyclopropylmethyl)-N7-(2-(4-(2,...)
Affinity DataKi:  0.300nM. Assay description: Displacement of [3H]SCH58261 from human adenosine A2A receptor expressed in HEK293 cells
In DepthDetails ArticlePubMed