BDBM50256520 (S)-2-(3-(3-mesitylureido)-2-naphthamido)-4-methylpentanoic acid::CHEMBL481493
SMILES CC(C)C[C@H](NC(=O)c1cc2ccccc2cc1NC(=O)Nc1c(C)cc(C)cc1C)C(O)=O
InChI Key InChIKey=XGDKLKWSGQTMTH-QHCPKHFHSA-N
Data  2 IC50
  Tab Delimited (TSV)   2D SDfile   Computed 3D by Vconf -m prep SDfile
Find this compound or compounds like it in BindingDB:
Activity Spreadsheet -- Enzyme Inhibition Constant Data from BindingDB
Found 2 hits for monomerid = 50256520
TargetGlycogen phosphorylase, liver form(Homo sapiens (Human))
Glaxosmithkline
Curated by ChEMBL
LigandPNGBDBM50256520((S)-2-(3-(3-mesitylureido)-2-naphthamido)-4-methyl...)
Affinity DataIC50:  1.43E+3nM. Assay description: Inhibition of liver glycogen phosphorylase A in human HepG2 cells assessed as inhibition of forskolin-induced glucogenolysis
In DepthDetails ArticlePubMed
TargetGlycogen phosphorylase, liver form(Homo sapiens (Human))
Glaxosmithkline
Curated by ChEMBL
LigandPNGBDBM50256520((S)-2-(3-(3-mesitylureido)-2-naphthamido)-4-methyl...)
Affinity DataIC50:  101nM. Assay description: Inhibition of human liver glycogen phosphorylase A by fluorescence plate reader assay
In DepthDetails ArticlePubMed