BDBM50256575 (S)-3-ethoxy-2-(3-(3-mesitylureido)-2-naphthamido)propanoic acid::CHEMBL475807
SMILES CCOC[C@H](NC(=O)c1cc2ccccc2cc1NC(=O)Nc1c(C)cc(C)cc1C)C(O)=O
InChI Key InChIKey=SAKQSQBEWSFYSX-QFIPXVFZSA-N
Data  3 IC50
  Tab Delimited (TSV)   2D SDfile   Computed 3D by Vconf -m prep SDfile
Find this compound or compounds like it in BindingDB:
Activity Spreadsheet -- Enzyme Inhibition Constant Data from BindingDB
Found 3 hits for monomerid = 50256575
TargetGlycogen phosphorylase, liver form(Homo sapiens (Human))
Glaxosmithkline
Curated by ChEMBL
LigandPNGBDBM50256575((S)-3-ethoxy-2-(3-(3-mesitylureido)-2-naphthamido)...)
Affinity DataIC50:  4.47E+3nM. Assay description: Inhibition of liver glycogen phosphorylase A in human HepG2 cells assessed as inhibition of forskolin-induced glucogenolysis
In DepthDetails ArticlePubMed
TargetCytochrome P450 2C9(Homo sapiens (Human))
Glaxosmithkline
Curated by ChEMBL
LigandPNGBDBM50256575((S)-3-ethoxy-2-(3-(3-mesitylureido)-2-naphthamido)...)
Affinity DataIC50:  3.30E+3nM. Assay description: Inhibition of CYP2C9 (unknown origin)
In DepthDetails ArticlePubMed
TargetGlycogen phosphorylase, liver form(Homo sapiens (Human))
Glaxosmithkline
Curated by ChEMBL
LigandPNGBDBM50256575((S)-3-ethoxy-2-(3-(3-mesitylureido)-2-naphthamido)...)
Affinity DataIC50:  56nM. Assay description: Inhibition of human liver glycogen phosphorylase A by fluorescence plate reader assay
In DepthDetails ArticlePubMed