BDBM50256773 CHEMBL474228::ethyl 2-(4,6-bis(4-hydroxypiperidin-1-yl)pyrimidin-2-ylamino)-4-methylthiazole-5-carboxylate
SMILES CCOC(=O)c1sc(Nc2nc(cc(n2)N2CCC(O)CC2)N2CCC(O)CC2)nc1C
InChI Key InChIKey=HAPJXJMSQIHATD-UHFFFAOYSA-N
Data  1 IC50
  Tab Delimited (TSV)   2D SDfile   Computed 3D by Vconf -m prep SDfile
Find this compound or compounds like it in BindingDB:
Activity Spreadsheet -- Enzyme Inhibition Constant Data from BindingDB
Found 1 hit for monomerid = 50256773
TargetcGMP-specific 3',5'-cyclic phosphodiesterase(Homo sapiens (Human))
Bristol-Myers Squibb Pharmaceutical Research Institute
Curated by ChEMBL
LigandPNGBDBM50256773(CHEMBL474228 | ethyl 2-(4,6-bis(4-hydroxypiperidin...)
Affinity DataIC50:  700nM. Assay description: Inhibition of PDE5
In DepthDetails ArticlePubMed