BDBM50257072 CHEMBL473839::N-(1-oxo-2-phenyl-1,2-dihydropyrido[2,3-e][1,2,4]triazolo[4,3-a]pyrazin-4-yl)-2-phenylacetamide
SMILES O=C(Cc1ccccc1)Nc1nc2ncccc2n2c1nn(-c1ccccc1)c2=O
InChI Key InChIKey=PWWAJFDRORIJNJ-UHFFFAOYSA-N
Data  3 KI
  Tab Delimited (TSV)   2D SDfile   Computed 3D by Vconf -m prep SDfile
Find this compound or compounds like it in BindingDB:
Activity Spreadsheet -- Enzyme Inhibition Constant Data from BindingDB
Found 3 hits for monomerid = 50257072
TargetAdenosine receptor A1(BOVINE)
Universita Di Firenze
Curated by ChEMBL
LigandPNGBDBM50257072(CHEMBL473839 | N-(1-oxo-2-phenyl-1,2-dihydropyrido...)
Affinity DataKi:  7.15nM. Assay description: Displacement of [3H]DPCPX from bovine brain cortical membrane adenosine A1 receptor
In DepthDetails ArticlePubMed
TargetAdenosine receptor A3(Homo sapiens (Human))
Universita Di Firenze
Curated by ChEMBL
LigandPNGBDBM50257072(CHEMBL473839 | N-(1-oxo-2-phenyl-1,2-dihydropyrido...)
Affinity DataKi:  11.7nM. Assay description: Displacement of [125I]AB-MECA from human cloned adenosine A3 receptor expressed in CHO cells
In DepthDetails ArticlePubMed
TargetAdenosine receptor A2a(Homo sapiens (Human))
Universita Di Firenze
Curated by ChEMBL
LigandPNGBDBM50257072(CHEMBL473839 | N-(1-oxo-2-phenyl-1,2-dihydropyrido...)
Affinity DataKi:  208nM. Assay description: Displacement of [3H]NECA from human cloned adenosine A2A receptor expressed in CHO cells
In DepthDetails ArticlePubMed