BDBM50257266 CHEMBL4074927
SMILES Cn1c(ccc1-c1ccc(O)cc1S(C)(=O)=O)C#N
InChI Key InChIKey=OQJGGYXNMXINFM-UHFFFAOYSA-N
Data  1 IC50  2 EC50
  Tab Delimited (TSV)   2D SDfile   Computed 3D by Vconf -m prep SDfile
Find this compound or compounds like it in BindingDB:
Activity Spreadsheet -- Enzyme Inhibition Constant Data from BindingDB
Found 3 hits for monomerid = 50257266
TargetAndrogen receptor(Homo sapiens (Human))
Pfizer
Curated by ChEMBL
LigandPNGBDBM50257266(CHEMBL4074927)
Affinity DataIC50:  1.47E+3nM. Assay description: Displacement of [3H]mibolerone from human androgen receptor expressed in African green monkey COS cells after 3.5 hrs by scintillation and luminescen...
In DepthDetails ArticlePubMed
TargetAndrogen receptor(Homo sapiens (Human))
Pfizer
Curated by ChEMBL
LigandPNGBDBM50257266(CHEMBL4074927)
Affinity DataEC50: >1.00E+4nM. Assay description: Agonist activity at human androgen receptor expressed in African green monkey CV-1 cells after 17 hrs by ARE luciferase reporter gene assay
In DepthDetails ArticlePubMed
TargetAndrogen receptor(Homo sapiens (Human))
Pfizer
Curated by ChEMBL
LigandPNGBDBM50257266(CHEMBL4074927)
Affinity DataEC50: >1.00E+4nM. Assay description: Displacement of [3H]mibolerone from human androgen receptor expressed in African green monkey COS cells after 3.5 hrs by scintillation and luminescen...
In DepthDetails ArticlePubMed