BDBM50257324 CHEMBL4091403
SMILES Cn1c(ccc1-c1cc(F)c(O)cc1F)C#N
InChI Key InChIKey=HMMSNHMTDUMEDQ-UHFFFAOYSA-N
Data  1 IC50  2 EC50
  Tab Delimited (TSV)   2D SDfile   Computed 3D by Vconf -m prep SDfile
Find this compound or compounds like it in BindingDB:
Activity Spreadsheet -- Enzyme Inhibition Constant Data from BindingDB
Found 3 hits for monomerid = 50257324
TargetAndrogen receptor(Homo sapiens (Human))
Pfizer
Curated by ChEMBL
LigandPNGBDBM50257324(CHEMBL4091403)
Affinity DataEC50: >1.00E+4nM. Assay description: Androgenic activity at human androgen receptor expressed in African green monkey CV-1 cells assessed as increase in interaction between VP16-fused AR...
In DepthDetails ArticlePubMed
TargetAndrogen receptor(Homo sapiens (Human))
Pfizer
Curated by ChEMBL
LigandPNGBDBM50257324(CHEMBL4091403)
Affinity DataEC50:  229nM. Assay description: Displacement of [3H]mibolerone from human androgen receptor expressed in African green monkey COS cells after 3.5 hrs by scintillation and luminescen...
In DepthDetails ArticlePubMed
TargetAndrogen receptor(Homo sapiens (Human))
Pfizer
Curated by ChEMBL
LigandPNGBDBM50257324(CHEMBL4091403)
Affinity DataIC50:  86nM. Assay description: Inhibition of dofetilide binding to human ERG
In DepthDetails ArticlePubMed