BDBM50257576 CHEMBL4072262
SMILES Fc1cc(ccc1Oc1ccnc(c1)C1CC1)-c1ccn2c(CC3CC3)nnc2c1C(F)(F)F
InChI Key InChIKey=JPUBJSRVNYOIBK-UHFFFAOYSA-N
Data  1 KI  1 Kd  1 EC50
  Tab Delimited (TSV)   2D SDfile   Computed 3D by Vconf -m prep SDfile
Find this compound or compounds like it in BindingDB:
Activity Spreadsheet -- Enzyme Inhibition Constant Data from BindingDB
Found 3 hits for monomerid = 50257576
TargetMetabotropic glutamate receptor 2(Homo sapiens (Human))
Leiden University
Curated by ChEMBL
LigandPNGBDBM50257576(CHEMBL4072262)
Affinity DataKi:  3.60nM. Assay description: Displacement of [3H]-JNJ46281222 from human metabotropic glutamate receptor 2 expressed in CHOK1 cell membranes after 60 mins by microbeta counting a...
In DepthDetails ArticlePubMed
TargetMetabotropic glutamate receptor 2(Homo sapiens (Human))
Leiden University
Curated by ChEMBL
LigandPNGBDBM50257576(CHEMBL4072262)
Affinity DataKd:  8.60nM. Assay description: Positive allosteric modulation of human metabotropic glutamate receptor 2 expressed in CHOK1 cell membranes assessed as increase in glutamate-induced...
In DepthDetails ArticlePubMed
TargetMetabotropic glutamate receptor 2(Homo sapiens (Human))
Leiden University
Curated by ChEMBL
LigandPNGBDBM50257576(CHEMBL4072262)
Affinity DataEC50:  19nM. Assay description: Binding affinity to human metabotropic glutamate receptor 2 expressed in CHOK1 cell membranes by scintillation proximity assay
In DepthDetails ArticlePubMed