BDBM50258431 CHEMBL523716::[4-(7-Fluoropyrrolo[1,2-a]quinoxalin-4-yl)piperazin-1-yl]hydroxyacetamidine
SMILES ONC(=N)CN1CCN(CC1)c1nc2cc(F)ccc2n2cccc12
InChI Key InChIKey=OHKKNUFVKFSRIU-UHFFFAOYSA-N
Data  7 KI  1 IC50
  Tab Delimited (TSV)   2D SDfile   Computed 3D by Vconf -m prep SDfile
Find this compound or compounds like it in BindingDB:
Activity Spreadsheet -- Enzyme Inhibition Constant Data from BindingDB
Found 8 hits for monomerid = 50258431
Target5-hydroxytryptamine receptor 3A(RAT)
European Research Centre For Drug Discovery And Development (Natsyndrugs)
Curated by ChEMBL
LigandPNGBDBM50258431(CHEMBL523716 | [4-(7-Fluoropyrrolo[1,2-a]quinoxali...)
Affinity DataKi:  0.800nM. Assay description: Displacement of [3H]LY278584 from 5HT3 receptor in rat cortical homogenate
In DepthDetails ArticlePubMed
Target5-hydroxytryptamine receptor 2A(Rattus norvegicus (rat))
European Research Centre For Drug Discovery And Development (Natsyndrugs)
Curated by ChEMBL
LigandPNGBDBM50258431(CHEMBL523716 | [4-(7-Fluoropyrrolo[1,2-a]quinoxali...)
Affinity DataKi: >1.00E+4nM. Assay description: Displacement of [3H]ketanserin from 5HT2A receptor in rat cortex
In DepthDetails ArticlePubMed
Target5-hydroxytryptamine receptor 1A(Rattus norvegicus (rat))
European Research Centre For Drug Discovery And Development (Natsyndrugs)
Curated by ChEMBL
LigandPNGBDBM50258431(CHEMBL523716 | [4-(7-Fluoropyrrolo[1,2-a]quinoxali...)
Affinity DataKi: >1.00E+4nM. Assay description: Displacement of [3H]8-OHDPAT from 5HT1A receptor in rat hippocampus
In DepthDetails ArticlePubMed
Target5-hydroxytryptamine receptor 4(GUINEA PIG)
European Research Centre For Drug Discovery And Development (Natsyndrugs)
Curated by ChEMBL
LigandPNGBDBM50258431(CHEMBL523716 | [4-(7-Fluoropyrrolo[1,2-a]quinoxali...)
Affinity DataKi: >1.00E+4nM. Assay description: Displacement of [3H]GR113808 from 5HT4 receptor in guinea pig striatum
In DepthDetails ArticlePubMed
TargetAlpha-2A adrenergic receptor [16-465](Rattus norvegicus (rat))
European Research Centre For Drug Discovery And Development (Natsyndrugs)
Curated by ChEMBL
LigandPNGBDBM50258431(CHEMBL523716 | [4-(7-Fluoropyrrolo[1,2-a]quinoxali...)
Affinity DataKi: >1.00E+4nM. Assay description: Displacement of [3H]RX821002 from adrenergic alpha2 receptor in rat cortex
In DepthDetails ArticlePubMed
TargetD(1A) dopamine receptor(RAT)
European Research Centre For Drug Discovery And Development (Natsyndrugs)
Curated by ChEMBL
LigandPNGBDBM50258431(CHEMBL523716 | [4-(7-Fluoropyrrolo[1,2-a]quinoxali...)
Affinity DataKi: >1.00E+4nM. Assay description: Displacement of [3H]SCH-23390 from dopamine D1 receptor in rat striatum
In DepthDetails ArticlePubMed
TargetD(2) dopamine receptor(Rattus norvegicus (rat))
European Research Centre For Drug Discovery And Development (Natsyndrugs)
Curated by ChEMBL
LigandPNGBDBM50258431(CHEMBL523716 | [4-(7-Fluoropyrrolo[1,2-a]quinoxali...)
Affinity DataKi: >1.00E+4nM. Assay description: Displacement of [3H]spiperone from dopamine D2 receptor in rat striatum
In DepthDetails ArticlePubMed
Target5-hydroxytryptamine receptor 3A(GUINEA PIG)
European Research Centre For Drug Discovery And Development (Natsyndrugs)
Curated by ChEMBL
LigandPNGBDBM50258431(CHEMBL523716 | [4-(7-Fluoropyrrolo[1,2-a]quinoxali...)
Affinity DataIC50:  5.75E+3nM. Assay description: Antagonist activity at 5HT3 receptor in spontaneously beating guinea pig right atrium assessed as inhibition of serotonin-induced maximum response by...
In DepthDetails ArticlePubMed