BDBM50258432 7-Fluoro-4-[4-(4H-[1,2,4]triazol-3-ylmethyl)-piperazin-1-yl]pyrrolo[1,2-a]quinoxaline::CHEMBL503987
SMILES Fc1ccc2c(c1)nc(N1CCN(Cc3nnc[nH]3)CC1)c1cccn21
InChI Key InChIKey=XONPZWREUKIQIP-UHFFFAOYSA-N
Data  1 KI  1 IC50
  Tab Delimited (TSV)   2D SDfile   Computed 3D by Vconf -m prep SDfile
Find this compound or compounds like it in BindingDB:
Activity Spreadsheet -- Enzyme Inhibition Constant Data from BindingDB
Found 2 hits for monomerid = 50258432
Target5-hydroxytryptamine receptor 3A(RAT)
European Research Centre For Drug Discovery And Development (Natsyndrugs)
Curated by ChEMBL
LigandPNGBDBM50258432(7-Fluoro-4-[4-(4H-[1,2,4]triazol-3-ylmethyl)-piper...)
Affinity DataKi:  3.40nM. Assay description: Displacement of [3H]LY278584 from 5HT3 receptor in rat cortical homogenate
In DepthDetails ArticlePubMed
Target5-hydroxytryptamine receptor 3A(GUINEA PIG)
European Research Centre For Drug Discovery And Development (Natsyndrugs)
Curated by ChEMBL
LigandPNGBDBM50258432(7-Fluoro-4-[4-(4H-[1,2,4]triazol-3-ylmethyl)-piper...)
Affinity DataIC50:  8.51E+3nM. Assay description: Antagonist activity at 5HT3 receptor in spontaneously beating guinea pig right atrium assessed as inhibition of serotonin-induced maximum response by...
In DepthDetails ArticlePubMed