BDBM50258458 7-Fluoro-4-[4-(methanesulfonamidoacetyl)piperazin-1-yl]pyrrolo[1,2-a]quinoxaline::CHEMBL466446
SMILES CS(=O)(=O)NC(=O)CN1CCN(CC1)c1nc2cc(F)ccc2n2cccc12
InChI Key InChIKey=MNJSUFNFALWRNV-UHFFFAOYSA-N
Data  1 KI
  Tab Delimited (TSV)   2D SDfile   Computed 3D by Vconf -m prep SDfile
Find this compound or compounds like it in BindingDB:
Activity Spreadsheet -- Enzyme Inhibition Constant Data from BindingDB
Found 1 hit for monomerid = 50258458
Target5-hydroxytryptamine receptor 3A(RAT)
European Research Centre For Drug Discovery And Development (Natsyndrugs)
Curated by ChEMBL
LigandPNGBDBM50258458(7-Fluoro-4-[4-(methanesulfonamidoacetyl)piperazin-...)
Affinity DataKi:  246nM. Assay description: Displacement of [3H]LY278584 from 5HT3 receptor in rat cortical homogenate
In DepthDetails ArticlePubMed