BDBM50259583 3-amino-5-(biphenyl-3-yl)-N-(diaminomethylene)pyrazine-2-carboxamide::CHEMBL513153
SMILES NC(=N)NC(=O)c1ncc(nc1N)-c1cccc(c1)-c1ccccc1
InChI Key InChIKey=GPXVQHMVAOPWSO-UHFFFAOYSA-N
Data  2 IC50
  Tab Delimited (TSV)   2D SDfile   Computed 3D by Vconf -m prep SDfile
Find this compound or compounds like it in BindingDB:
Activity Spreadsheet -- Enzyme Inhibition Constant Data from BindingDB
Found 2 hits for monomerid = 50259583
TargetAcid-sensing ion channel 3(Rattus norvegicus)
Merck Research Laboratories
Curated by ChEMBL
LigandPNGBDBM50259583(3-amino-5-(biphenyl-3-yl)-N-(diaminomethylene)pyra...)
Affinity DataIC50:  950nM. Assay description: Inhibition of rat ASIC3 assessed as inhibition of peak current by patch clamp electrophisiology
In DepthDetails ArticlePubMed
TargetAcid-sensing ion channel 3(Homo sapiens (Human))
Merck Research Laboratories
Curated by ChEMBL
LigandPNGBDBM50259583(3-amino-5-(biphenyl-3-yl)-N-(diaminomethylene)pyra...)
Affinity DataIC50:  490nM. Assay description: Inhibition of ASIC3 (unknown origin) assessed as inhibition of peak current by patch clamp electrophisiology
In DepthDetails ArticlePubMed