BDBM50259999 CHEMBL4072992
SMILES Cc1ccc(cc1)C(=O)NC[C@]1(O)CO[C@H](CNC(=O)c2ccccc2Cl)[C@H]1O
InChI Key InChIKey=CFKZQPHVPVTSEQ-OPYAIIAOSA-N
Data  2 EC50
  Tab Delimited (TSV)   2D SDfile   Computed 3D by Vconf -m prep SDfile
Find this compound or compounds like it in BindingDB:
Activity Spreadsheet -- Enzyme Inhibition Constant Data from BindingDB
Found 2 hits for monomerid = 50259999
TargetSignal transduction protein TRAP(Staphylococcus aureus (strain Mu50 / ATCC 700699))
Ghent University
Curated by ChEMBL
LigandPNGBDBM50259999(CHEMBL4072992)
Affinity DataEC50:  7.97E+4nM. Assay description: Inhibition of methicillin-resistant Staphylococcus aureus Mu50 TRAP assessed as potentiation of vancomycin-induced antibiofilm activity treated for 4...
In DepthDetails ArticlePubMed
TargetSignal transduction protein TRAP(Staphylococcus aureus (strain Mu50 / ATCC 700699))
Ghent University
Curated by ChEMBL
LigandPNGBDBM50259999(CHEMBL4072992)
Affinity DataEC50:  4.19E+4nM. Assay description: Inhibition of methicillin-resistant Staphylococcus aureus Mu50 TRAP assessed as potentiation of vancomycin-induced antibiofilm activity cotreated wit...
In DepthDetails ArticlePubMed