BDBM50260521 CHEMBL507697::ethyl (1R,3aR,4aR,6R,8aR,9S,9aS)-9-((E)-2-(5-(2-fluoro-3-methylphenyl)pyridin-2-yl)vinyl)-1-methyl-3-oxo-dodecahydronaphtho[2,3-c]furan-6-ylcarbamate
SMILES CCOC(=O)N[C@@H]1CC[C@@H]2[C@H](C[C@@H]3[C@@H]([C@@H](C)OC3=O)[C@H]2C=Cc2ccc(cn2)-c2cccc(C)c2F)C1
InChI Key InChIKey=YGKYFVOUPXDQQA-ZVSUMJKVSA-N
Data  1 KI
  Tab Delimited (TSV)   2D SDfile   Computed 3D by Vconf -m prep SDfile
Find this compound or compounds like it in BindingDB:
Activity Spreadsheet -- Enzyme Inhibition Constant Data from BindingDB
Found 1 hit for monomerid = 50260521
TargetProteinase-activated receptor 1(Homo sapiens (Human))
Schering-Plough Research Institute
Curated by ChEMBL
LigandPNGBDBM50260521(CHEMBL507697 | ethyl (1R,3aR,4aR,6R,8aR,9S,9aS)-9-...)
Affinity DataKi:  11nM. Assay description: Displacement of [3H]haTRAP from PAR1 in human platelets
In DepthDetails ArticlePubMed