BDBM50260538 (S)-N-(1-(dimethylamino)-3,3-dimethyl-1-oxobutan-2-yl)-3-(2-morpholinoethyl)-2-oxo-2,3-dihydrobenzo[d]imidazole-1-carboxamide::CHEMBL522675
SMILES CN(C)C(=O)[C@@H](NC(=O)n1c2ccccc2n(CCN2CCOCC2)c1=O)C(C)(C)C
InChI Key InChIKey=YFIBTPCBIAMZLW-GOSISDBHSA-N
Data  1 KI  1 IC50
  Tab Delimited (TSV)   2D SDfile   Computed 3D by Vconf -m prep SDfile
Find this compound or compounds like it in BindingDB:
Activity Spreadsheet -- Enzyme Inhibition Constant Data from BindingDB
Found 2 hits for monomerid = 50260538
TargetCannabinoid receptor 2(Homo sapiens (Human))
Pfizer
Curated by ChEMBL
LigandPNGBDBM50260538((S)-N-(1-(dimethylamino)-3,3-dimethyl-1-oxobutan-2...)
Affinity DataKi:  25nM. Assay description: Displacement of [3H]CP-55940 from human CB2 receptor
In DepthDetails ArticlePubMed
TargetCannabinoid receptor 1(Homo sapiens (Human))
Pfizer
Curated by ChEMBL
LigandPNGBDBM50260538((S)-N-(1-(dimethylamino)-3,3-dimethyl-1-oxobutan-2...)
Affinity DataIC50: >1.00E+4nM. Assay description: Displacement of [3H]SR141716A from human CB1 receptor
In DepthDetails ArticlePubMed