BDBM50260974 3-(2-aminoquinazolin-6-yl)-4-methyl-1-(4-(oxazol-2-yl)phenyl)pyridin-2(1H)-one::CHEMBL525893
SMILES Cc1ccn(-c2ccc(cc2)-c2ncco2)c(=O)c1-c1ccc2nc(N)ncc2c1
InChI Key InChIKey=IGFSMGCBFTXTJK-UHFFFAOYSA-N
Data  6 IC50
  Tab Delimited (TSV)   2D SDfile   Computed 3D by Vconf -m prep SDfile
Find this compound or compounds like it in BindingDB:
Activity Spreadsheet -- Enzyme Inhibition Constant Data from BindingDB
Found 6 hits for monomerid = 50260974
TargetTyrosine-protein kinase ABL1(Homo sapiens (Human))
Amgen
Curated by ChEMBL
LigandPNGBDBM50260974(3-(2-aminoquinazolin-6-yl)-4-methyl-1-(4-(oxazol-2...)
Affinity DataIC50: >2.50E+4nM. Assay description: Inhibition of Abl (unknown origin) by TR-FRET assay
In DepthDetails ArticlePubMed
TargetVascular endothelial growth factor receptor 2(Homo sapiens (Human))
Amgen
Curated by ChEMBL
LigandPNGBDBM50260974(3-(2-aminoquinazolin-6-yl)-4-methyl-1-(4-(oxazol-2...)
Affinity DataIC50: >5.00E+3nM. Assay description: Inhibition of KDR (unknown origin) by TR-FRET assay
In DepthDetails ArticlePubMed
TargetMast/stem cell growth factor receptor Kit(Homo sapiens (Human))
Amgen
Curated by ChEMBL
LigandPNGBDBM50260974(3-(2-aminoquinazolin-6-yl)-4-methyl-1-(4-(oxazol-2...)
Affinity DataIC50:  22nM. Assay description: Inhibition of c-Kit (unknown origin) by TR-FRET assay
In DepthDetails ArticlePubMed
TargetProto-oncogene tyrosine-protein kinase Src(Homo sapiens (Human))
Amgen
Curated by ChEMBL
LigandPNGBDBM50260974(3-(2-aminoquinazolin-6-yl)-4-methyl-1-(4-(oxazol-2...)
Affinity DataIC50: >5.00E+3nM. Assay description: Inhibition of Src (unknown origin) by TR-FRET assay
In DepthDetails ArticlePubMed
TargetMast/stem cell growth factor receptor Kit(Homo sapiens (Human))
Amgen
Curated by ChEMBL
LigandPNGBDBM50260974(3-(2-aminoquinazolin-6-yl)-4-methyl-1-(4-(oxazol-2...)
Affinity DataIC50:  16nM. Assay description: Inhibition of SCF-induced phosphorylation of c-Kit (unknown origin) in MO7e cells by TR-FRET assay
In DepthDetails ArticlePubMed
TargetTyrosine-protein kinase Lck(Homo sapiens (Human))
Amgen
Curated by ChEMBL
LigandPNGBDBM50260974(3-(2-aminoquinazolin-6-yl)-4-methyl-1-(4-(oxazol-2...)
Affinity DataIC50:  7.80E+3nM. Assay description: Inhibition of Lck (unknown origin) by TR-FRET assay
In DepthDetails ArticlePubMed