BDBM50261114 CHEMBL500551::Ethyl [(1R,3aR,4aR,6R,8aR,9S,9aS)-9-[(E)-2-[5-(3-fluorophenyl)-2-pyridinyl]ethenyl]-dodecahydro-1-methyl-3-oxonaphtho[2,3-c]furan-6-yl]methylcarbamate
SMILES CCOC(=O)N(C)[C@@H]1CC[C@@H]2[C@H](C[C@@H]3[C@@H]([C@@H](C)OC3=O)[C@H]2\C=C\c2ccc(cn2)-c2cccc(F)c2)C1
InChI Key InChIKey=AWKCXFASCWWOOA-CSQMIITRSA-N
Data  1 KI
  Tab Delimited (TSV)   2D SDfile   Computed 3D by Vconf -m prep SDfile
Find this compound or compounds like it in BindingDB:
Activity Spreadsheet -- Enzyme Inhibition Constant Data from BindingDB
Found 1 hit for monomerid = 50261114
TargetProteinase-activated receptor 1(Homo sapiens (Human))
Schering-Plough Research Institute
Curated by ChEMBL
LigandPNGBDBM50261114(CHEMBL500551 | Ethyl [(1R,3aR,4aR,6R,8aR,9S,9aS)-9...)
Affinity DataKi:  4.10nM. Assay description: Displacement of [3H]haTRAP from PAR1 in human platelets
In DepthDetails ArticlePubMed