BDBM50261194 1-{2-[(1S)-(Methylaminoacetamido)-2-methylpropyl]-6-fluorophenyl}-4-[(2R)-methyl-3-(2,4-dichlorophenyl)propionyl]piperazine::CHEMBL524443
SMILES CNCC(=O)N[C@@H](C(C)C)c1cccc(F)c1N1CCN(CC1)C(=O)[C@H](C)Cc1ccc(Cl)cc1Cl
InChI Key InChIKey=IUHYYYUXPSCOGY-CJAUYULYSA-N
Data  1 KI
  Tab Delimited (TSV)   2D SDfile   Computed 3D by Vconf -m prep SDfile
Find this compound or compounds like it in BindingDB:
Activity Spreadsheet -- Enzyme Inhibition Constant Data from BindingDB
Found 1 hit for monomerid = 50261194
TargetMelanocortin receptor 4(Homo sapiens (Human))
Neurocrine Biosciences
Curated by ChEMBL
LigandPNGBDBM50261194(1-{2-[(1S)-(Methylaminoacetamido)-2-methylpropyl]-...)
Affinity DataKi:  5.30nM. Assay description: Displacement of [125I]NDP-MSH from human MC4R expressed in HEK293 cells
In DepthDetails ArticlePubMed