BDBM50261199 1-{2-[(1S)-(1-Methyl-3-azetadinylcarbonyl)-amino-2-methylpropyl]-4-chlorophenyl}-4-[(2R)-methyl-3-(4-chlorophenyl)propionyl]piperazine::CHEMBL498150
SMILES CC(C)[C@H](NC(=O)C1CN(C)C1)c1cc(Cl)ccc1N1CCN(CC1)C(=O)[C@H](C)Cc1ccc(Cl)cc1
InChI Key InChIKey=SYIWIZYUJLMOJX-HRFSGMKKSA-N
Data  4 KI  1 IC50
  Tab Delimited (TSV)   2D SDfile   Computed 3D by Vconf -m prep SDfile
Find this compound or compounds like it in BindingDB:
Activity Spreadsheet -- Enzyme Inhibition Constant Data from BindingDB
Found 5 hits for monomerid = 50261199
TargetMelanocortin receptor 4(Homo sapiens (Human))
Neurocrine Biosciences
Curated by ChEMBL
LigandPNGBDBM50261199(1-{2-[(1S)-(1-Methyl-3-azetadinylcarbonyl)-amino-2...)
Affinity DataKi:  5.40nM. Assay description: Displacement of [125I]NDP-MSH from human MC4R expressed in HEK293 cells
In DepthDetails ArticlePubMed
TargetMelanocortin receptor 3(Homo sapiens (Human))
Neurocrine Biosciences
Curated by ChEMBL
LigandPNGBDBM50261199(1-{2-[(1S)-(1-Methyl-3-azetadinylcarbonyl)-amino-2...)
Affinity DataKi:  380nM. Assay description: Displacement of [125I]NDP-MSH from human MC3R expressed in HEK293 cells
In DepthDetails ArticlePubMed
TargetMelanocortin receptor 5(Homo sapiens (Human))
Neurocrine Biosciences
Curated by ChEMBL
LigandPNGBDBM50261199(1-{2-[(1S)-(1-Methyl-3-azetadinylcarbonyl)-amino-2...)
Affinity DataKi:  400nM. Assay description: Displacement of [125I]NDP-MSH from human MC5R expressed in HEK293 cells
In DepthDetails ArticlePubMed
TargetMelanocyte-stimulating hormone receptor(Homo sapiens (Human))
Neurocrine Biosciences
Curated by ChEMBL
LigandPNGBDBM50261199(1-{2-[(1S)-(1-Methyl-3-azetadinylcarbonyl)-amino-2...)
Affinity DataKi:  8.20E+3nM. Assay description: Displacement of [125I]NDP-MSH from human MC1R expressed in HEK293 cells
In DepthDetails ArticlePubMed
TargetMelanocortin receptor 4(Homo sapiens (Human))
Neurocrine Biosciences
Curated by ChEMBL
LigandPNGBDBM50261199(1-{2-[(1S)-(1-Methyl-3-azetadinylcarbonyl)-amino-2...)
Affinity DataIC50:  160nM. Assay description: Antagonist activity at human MC4R expressed in CHO cells assessed as inhibition of alpha-MSH-induced cAMP production by ELISA
In DepthDetails ArticlePubMed