BDBM50261231 1-{2-[(1S)-(Azetidine-3-carboxamido)-2-methylpropyl]-4-chlorophenyl}-4-[(2R)-methyl-3-(2-methoxy-4-dichlorophenyl)propionyl]piperazine::CHEMBL468636
SMILES COc1cc(Cl)ccc1C[C@@H](C)C(=O)N1CCN(CC1)c1ccc(Cl)cc1[C@@H](NC(=O)C1CNC1)C(C)C
InChI Key InChIKey=WKJNPGWIMYANRU-WINIVTDRSA-N
Data  1 KI
  Tab Delimited (TSV)   2D SDfile   Computed 3D by Vconf -m prep SDfile
Find this compound or compounds like it in BindingDB:
Activity Spreadsheet -- Enzyme Inhibition Constant Data from BindingDB
Found 1 hit for monomerid = 50261231
TargetMelanocortin receptor 4(Homo sapiens (Human))
Neurocrine Biosciences
Curated by ChEMBL
LigandPNGBDBM50261231(1-{2-[(1S)-(Azetidine-3-carboxamido)-2-methylpropy...)
Affinity DataKi:  1.30nM. Assay description: Displacement of [125I]NDP-MSH from human MC4R expressed in HEK293 cells
In DepthDetails ArticlePubMed