BDBM50261520 CHEMBL526730::c[Glu22-Orn26][Gly8]GLP-1(7-37)-NH2
SMILES CC[C@H](C)[C@H](NC(=O)[C@H](Cc1ccccc1)NC(=O)[C@H](CCC(O)=O)NC(=O)[C@@H]1CCCNC(=O)CC[C@H](NC(=O)[C@H](CCC(O)=O)NC(=O)[C@H](CC(C)C)NC(=O)[C@H](Cc2ccc(O)cc2)NC(=O)[C@H](CO)NC(=O)[C@H](CO)NC(=O)[C@@H](NC(=O)[C@H](CC(O)=O)NC(=O)[C@H](CO)NC(=O)[C@@H](NC(=O)[C@H](Cc2ccccc2)NC(=O)[C@@H](NC(=O)CNC(=O)[C@H](CCC(O)=O)NC(=O)CNC(=O)[C@@H](N)Cc2c[nH]cn2)[C@H](C)O)[C@H](C)O)C(C)C)C(=O)N[C@@H](CCC(N)=O)C(=O)N[C@@H](C)C(=O)N[C@@H](C)C(=O)N1)C(=O)N[C@@H](C)C(=O)N[C@@H](Cc1c[nH]c2ccccc12)C(=O)N[C@@H](CC(C)C)C(=O)N[C@@H](C(C)C)C(=O)N[C@@H](CCCCN)C(=O)NCC(=O)N[C@@H](CCCNC(N)=N)C(=O)NCC(N)=O
InChI Key InChIKey=KMMGHNYLBGRIJN-NINLSKNRSA-N
Data  1 IC50  1 EC50
  Tab Delimited (TSV)   2D SDfile   Computed 3D by Vconf -m prep SDfile
Find this compound or compounds like it in BindingDB:
Activity Spreadsheet -- Enzyme Inhibition Constant Data from BindingDB
Found 2 hits for monomerid = 50261520
TargetGlucagon-like peptide 1 receptor(Homo sapiens (Human))
Amgen
Curated by ChEMBL
LigandPNGBDBM50261520(CHEMBL526730 | c[Glu22-Orn26][Gly8]GLP-1(7-37)-NH2)
Affinity DataEC50:  0.0190nM. Assay description: Agonist activity at human GLP1R expressed in CHO cells assessed as increase in cAMP level by cAMP-response element/luciferase activation assay
In DepthDetails ArticlePubMed
TargetGlucagon-like peptide 1 receptor(Homo sapiens (Human))
Amgen
Curated by ChEMBL
LigandPNGBDBM50261520(CHEMBL526730 | c[Glu22-Orn26][Gly8]GLP-1(7-37)-NH2)
Affinity DataIC50:  6.40nM. Assay description: Displacement of [125I]GLP1 from human GLP1R expressed in CHOK1 cells
In DepthDetails ArticlePubMed