BDBM50262080 4-(6-(3-(piperazin-1-yl)phenyl)pyrazolo[1,5-a]pyrimidin-3-yl)quinoline::CHEMBL468216
SMILES C1CN(CCN1)c1cccc(c1)-c1cnc2c(cnn2c1)-c1ccnc2ccccc12
InChI Key InChIKey=OYWSZMCDHQWGRT-UHFFFAOYSA-N
Data  1 IC50
  Tab Delimited (TSV)   2D SDfile   Computed 3D by Vconf -m prep SDfile
Find this compound or compounds like it in BindingDB:
Activity Spreadsheet -- Enzyme Inhibition Constant Data from BindingDB
Found 1 hit for monomerid = 50262080
TargetBone morphogenetic protein 4(Homo sapiens (Human))
Harvard Medical School
Curated by ChEMBL
LigandPNGBDBM50262080(4-(6-(3-(piperazin-1-yl)phenyl)pyrazolo[1,5-a]pyri...)
Affinity DataIC50:  2.00E+4nM. Assay description: Inhibition of BMP4 (unknown origin)-induced phosphorylation of SMAD 1/5/8 by cytoblot cellular ELISA
In DepthDetails ArticlePubMed