BDBM50262500 (E)-1-(2-Hydroxy-4-methoxy-5-(pyrrolidin-1-ylmethyl)phenyl)-3-phenylprop-2-en-1-one::CHEMBL505798
SMILES COc1cc(O)c(cc1CN1CCCC1)C(=O)\C=C\c1ccccc1
InChI Key InChIKey=JXKOILZIXHUTSK-MDZDMXLPSA-N
Data  1 IC50
  Tab Delimited (TSV)   2D SDfile   Computed 3D by Vconf -m prep SDfile
Find this compound or compounds like it in BindingDB:
Activity Spreadsheet -- Enzyme Inhibition Constant Data from BindingDB
Found 1 hit for monomerid = 50262500
TargetCyclin-dependent kinase 1(Homo sapiens (Human))
Dalian University Of Technology
Curated by ChEMBL
LigandPNGBDBM50262500((E)-1-(2-Hydroxy-4-methoxy-5-(pyrrolidin-1-ylmethy...)
Affinity DataIC50: >2.00E+4nM. Assay description: Inhibition of Cdk1/cyclin B
In DepthDetails ArticlePubMed