BDBM50263286 2-[[2-[4-(2-Nitrophenyl)-1-piperazinyl]ethyl]thio]1H-benzimidazole::CHEMBL514855
SMILES [O-][N+](=O)c1ccccc1N1CCN(CCSc2nc3ccccc3[nH]2)CC1
InChI Key InChIKey=DRRVBLIPLMHHGR-UHFFFAOYSA-N
Data  1 KI
  Tab Delimited (TSV)   2D SDfile   Computed 3D by Vconf -m prep SDfile
Find this compound or compounds like it in BindingDB:
Activity Spreadsheet -- Enzyme Inhibition Constant Data from BindingDB
Found 1 hit for monomerid = 50263286
Target5-hydroxytryptamine receptor 1A(Rattus norvegicus (rat))
Università
Curated by ChEMBL
LigandPNGBDBM50263286(2-[[2-[4-(2-Nitrophenyl)-1-piperazinyl]ethyl]thio]...)
Affinity DataKi:  95.2nM. Assay description: Displacement of [3H]8-OH-DPAT from 5HT1A receptor in CRL:CD(SD)BR-COBS rat hippocampus
In DepthDetails ArticlePubMed