BDBM50263479 CHEMBL4092880
SMILES [H][C@@]12CN(Cc3c1c1ccccc1n3Cc1ccc(cc1)C(=O)NO)C(=O)N(C)C2=O
InChI Key InChIKey=ZCAIUGLOTHAUQX-MRXNPFEDSA-N
Data  3 KI
  Tab Delimited (TSV)   2D SDfile   Computed 3D by Vconf -m prep SDfile
Find this compound or compounds like it in BindingDB:
Activity Spreadsheet -- Enzyme Inhibition Constant Data from BindingDB
Found 3 hits for monomerid = 50263479
TargetHistone deacetylase 6(Homo sapiens (Human))
University Of Regensburg
Curated by ChEMBL
LigandPNGBDBM50263479(CHEMBL4092880)
Affinity DataKi:  0.700nM. Assay description: Inhibition of full length recombinant human N-terminal GST-tagged HDAC6 expressed in baculovirus-infected Sf9 insect cells using RHKK(Ac)AMC as subst...
In DepthDetails ArticlePubMed
TargetHistone deacetylase 8(Homo sapiens (Human))
University Of Regensburg
Curated by ChEMBL
LigandPNGBDBM50263479(CHEMBL4092880)
Affinity DataKi:  999nM. Assay description: Inhibition of recombinant human C-terminal His-tagged HDAC8 (1 to 377 residues) expressed in baculovirus-infected insect cells using RHK(Ac)K(Ac)AMC ...
In DepthDetails ArticlePubMed
TargetHistone deacetylase 2(Homo sapiens (Human))
University Of Regensburg
Curated by ChEMBL
LigandPNGBDBM50263479(CHEMBL4092880)
Affinity DataKi:  5.21E+3nM. Assay description: Inhibition of full length recombinant human C-terminal GST-tagged HDAC2 expressed in baculovirus-infected insect cells using RHKK(Ac)AMC as substrate...
In DepthDetails ArticlePubMed