BDBM50263880 2-(4-(dimethylamino)styryl)benzofuran-5-ol::CHEMBL491203
SMILES CN(C)c1ccc(\C=C\c2cc3cc(O)ccc3o2)cc1
InChI Key InChIKey=HDARYIWAGLMUDF-WEVVVXLNSA-N
Data  1 IC50
  Tab Delimited (TSV)   2D SDfile   Computed 3D by Vconf -m prep SDfile
Find this compound or compounds like it in BindingDB:
Activity Spreadsheet -- Enzyme Inhibition Constant Data from BindingDB
Found 1 hit for monomerid = 50263880
TargetAmyloid-beta precursor protein(Homo sapiens (Human))
Institute Of Science And Technology
Curated by ChEMBL
LigandPNGBDBM50263880(2-(4-(dimethylamino)styryl)benzofuran-5-ol | CHEMB...)
Affinity DataIC50:  160nM. Assay description: Inhibition of amyloid beta42 fibril formation by thioflavin T formation
In DepthDetails ArticlePubMed