BDBM50263888 CHEMBL491209::Ethyl 4-(2-oxo-2,3-dihydro-1Hbenzo[d]imidazol-1-yl)-1,4'-bipiperidine-1'-carboxylate
SMILES CCOC(=O)N1CCC(CC1)N1CCC(CC1)n1c2ccccc2[nH]c1=O
InChI Key InChIKey=VBYGBDXPFRYDEZ-UHFFFAOYSA-N
Data  1 IC50  5 EC50
  Tab Delimited (TSV)   2D SDfile   Computed 3D by Vconf -m prep SDfile
Find this compound or compounds like it in BindingDB:
Activity Spreadsheet -- Enzyme Inhibition Constant Data from BindingDB
Found 6 hits for monomerid = 50263888
TargetMuscarinic acetylcholine receptor M1(Homo sapiens (Human))
Vanderbilt University Medical Center
Curated by ChEMBL
LigandPNGBDBM50263888(CHEMBL491209 | Ethyl 4-(2-oxo-2,3-dihydro-1Hbenzo[...)
Affinity DataEC50:  2.10nM. Assay description: Agonist activity at muscarinic M1 receptor (unknown origin)
In DepthDetails ArticlePubMed
TargetD(2) dopamine receptor(Homo sapiens (Human))
Vanderbilt University Medical Center
Curated by ChEMBL
LigandPNGBDBM50263888(CHEMBL491209 | Ethyl 4-(2-oxo-2,3-dihydro-1Hbenzo[...)
Affinity DataIC50: >1.00E+4nM. Assay description: Inhibition of dopamine D2 receptor (unknown origin)
In DepthDetails ArticlePubMed
TargetMuscarinic acetylcholine receptor M5(Homo sapiens (Human))
Vanderbilt University Medical Center
Curated by ChEMBL
LigandPNGBDBM50263888(CHEMBL491209 | Ethyl 4-(2-oxo-2,3-dihydro-1Hbenzo[...)
Affinity DataEC50:  34.3nM. Assay description: Agonist activity at muscarinic M5 receptor (unknown origin)
In DepthDetails ArticlePubMed
TargetMuscarinic acetylcholine receptor M3(Homo sapiens (Human))
Vanderbilt University Medical Center
Curated by ChEMBL
LigandPNGBDBM50263888(CHEMBL491209 | Ethyl 4-(2-oxo-2,3-dihydro-1Hbenzo[...)
Affinity DataEC50:  113nM. Assay description: Agonist activity at muscarinic M3 receptor (unknown origin)
In DepthDetails ArticlePubMed
TargetMuscarinic acetylcholine receptor M4(Homo sapiens (Human))
Vanderbilt University Medical Center
Curated by ChEMBL
LigandPNGBDBM50263888(CHEMBL491209 | Ethyl 4-(2-oxo-2,3-dihydro-1Hbenzo[...)
Affinity DataEC50:  9.10nM. Assay description: Agonist activity at muscarinic M4 receptor (unknown origin)
In DepthDetails ArticlePubMed
TargetMuscarinic acetylcholine receptor M2(Homo sapiens (Human))
Vanderbilt University Medical Center
Curated by ChEMBL
LigandPNGBDBM50263888(CHEMBL491209 | Ethyl 4-(2-oxo-2,3-dihydro-1Hbenzo[...)
Affinity DataEC50:  11.9nM. Assay description: Agonist activity at muscarinic M2 receptor (unknown origin)
In DepthDetails ArticlePubMed