BDBM50264152 CHEMBL4072536
SMILES COc1ccc(CNC(=O)c2ccc(F)c(OC3CCCC3)c2)c(c1)C(F)(F)F
InChI Key InChIKey=ITKBTQGYZFSJJY-UHFFFAOYSA-N
Data  2 IC50
  Tab Delimited (TSV)   2D SDfile   Computed 3D by Vconf -m prep SDfile
Find this compound or compounds like it in BindingDB:
Activity Spreadsheet -- Enzyme Inhibition Constant Data from BindingDB
Found 2 hits for monomerid = 50264152
TargetBifunctional epoxide hydrolase 2(Rattus norvegicus)
University Of California Davis
Curated by ChEMBL
LigandPNGBDBM50264152(CHEMBL4072536)
Affinity DataIC50:  1.70nM. Assay description: Inhibition of recombinant rat sEH using MNPC as substrate by fluorescence-based assay
In DepthDetails ArticlePubMed
TargetBifunctional epoxide hydrolase 2(Homo sapiens (Human))
University Of California Davis
Curated by ChEMBL
LigandPNGBDBM50264152(CHEMBL4072536)
Affinity DataIC50:  0.400nM. Assay description: Inhibition of recombinant human sEH using MNPC as substrate by fluorescence-based assay
In DepthDetails ArticlePubMed